MVN error building CAS 3.5.2

classic Classic list List threaded Threaded
1 message Options
Reply | Threaded
Open this post in threaded view
|

MVN error building CAS 3.5.2

Gavin
I could do with some help as I am not very familiar with Maven builds. I am trying to build CAS-3.5.2.1 using 'mvn install' but I get an error. I have attached the generated log file and also copied the console output below. Thank you!

[ERROR] ABORT
Aug 11, 2014 6:30:44 PM org.aspectj.weaver.tools.Jdk14Trace info
INFO: Dumping to C:\Users\gavin\Desktop\cas-server-3.5.2-release\cas-server-3.5.2\.\ajcore.20140811.
183044.461.txt
[INFO] ------------------------------------------------------------------------
[INFO] Reactor Summary:
[INFO]
[INFO] Jasig Central Authentication Service .............. SUCCESS [1.340s]
[INFO] Jasig CAS Core .................................... FAILURE [4.699s]
[INFO] Jasig CAS Web Application ......................... SKIPPED
[INFO] Jasig CAS Generic Support ......................... SKIPPED
[INFO] Jasig CAS JDBC Support ............................ SKIPPED
[INFO] Jasig CAS LDAP Support ............................ SKIPPED
[INFO] Jasig CAS Legacy Support .......................... SKIPPED
[INFO] Jasig CAS OpenId Support .......................... SKIPPED
[INFO] Jasig CAS RADIUS Support .......................... SKIPPED
[INFO] Jasig CAS SPNEGO/NTLM Support ..................... SKIPPED
[INFO] Jasig CAS Trusted User Support .................... SKIPPED
[INFO] Jasig CAS X.509 Client Certificate Support ........ SKIPPED
[INFO] Jasig CAS OAuth Support ........................... SKIPPED
[INFO] Jasig CAS JBoss Cache Integration ................. SKIPPED
[INFO] Jasig CAS Memcached Integration ................... SKIPPED
[INFO] Jasig CAS Ehcache Integration ..................... SKIPPED
[INFO] Jasig CAS Restlet Integration ..................... SKIPPED
[INFO] Jasig CAS - Uber WAR .............................. SKIPPED
[INFO] Jasig CAS Documentation ........................... SKIPPED
[INFO] Jasig CAS ClearPass Extension ..................... SKIPPED
[INFO] ------------------------------------------------------------------------
[INFO] BUILD FAILURE
[INFO] ------------------------------------------------------------------------
[INFO] Total time: 6.515s
[INFO] Finished at: Mon Aug 11 18:30:44 BST 2014
[INFO] Final Memory: 35M/158M
[INFO] ------------------------------------------------------------------------
[ERROR] Failed to execute goal org.codehaus.mojo:aspectj-maven-plugin:1.3.1:compile (default) on pro
ject cas-server-core: Compiler errors:
[ERROR] error at (no source information available)
[ERROR] C:\Users\gavin\Desktop\cas-server-3.5.2-release\cas-server-3.5.2\cas-server-core\src\main\ja
va\org\jasig\cas\web\view\Saml10SuccessResponseView.java:0::0 Internal compiler error
[ERROR] org.aspectj.apache.bcel.classfile.ClassFormatException: File: 'java/lang/CharSequence.class'
: Invalid byte tag in constant pool: 15
[ERROR] at org.aspectj.apache.bcel.classfile.ClassParser.readConstantPool(ClassParser.java:192)
[ERROR] at org.aspectj.apache.bcel.classfile.ClassParser.parse(ClassParser.java:131)
[ERROR] at org.aspectj.weaver.bcel.BcelWorld.lookupJavaClass(BcelWorld.java:424)
[ERROR] at org.aspectj.weaver.bcel.BcelWorld.resolveDelegate(BcelWorld.java:376)
[ERROR] at org.aspectj.weaver.World.resolveToReferenceType(World.java:461)
[ERROR] at org.aspectj.weaver.World.resolve(World.java:305)
[ERROR] at org.aspectj.weaver.World.resolve(World.java:218)
--
You are currently subscribed to [hidden email] as: [hidden email]
To unsubscribe, change settings or access archives, see http://www.ja-sig.org/wiki/display/JSG/jasig-discuss

ajcore.20140811.182000.566.txt (66K) Download Attachment